Target
Aldehyde dehydrogenase, mitochondrial
Ligand
BDBM153690
Substrate
Meas. Tech.
ALDH2 Assay
IC50
464±n/a nM
Citation
 Cannizzaro, CEGraupe, MGuerrero, JALu, YStrickley, RGVenkataramani, CZablocki, J Compounds for the treatment of addiction US Patent  US10507215 Publication Date 12/17/2019 
Target
Name:
Aldehyde dehydrogenase, mitochondrial
Synonyms:
ALDH class 2 ALDH2 ALDHI Aldehyde dehydrogenase (ALDH2)
Type:
Enzyme
Mol. Mass.:
56382.67
Organism:
Homo sapiens (Human)
Description:
P05091
Residue:
517
  
Inhibitor
Name:
BDBM153690
Synonyms:
US10507215, Compound 7 US9610299, Example 7
Type:
Small organic molecule
Emp. Form.:
C19H13ClF2N2O2
Mol. Mass.:
374.769
SMILES:
Fc1ccc(F)c(C(=O)NCc2ccc(cc2)-c2cc[nH]c(=O)c2)c1Cl
: