Target
Amine oxidase [flavin-containing] A
Ligand
BDBM153692
Substrate
Meas. Tech.
MAO-A and MAO-B Assays
IC50
>130000±n/a nM
Citation
 Cannizzaro, CEGraupe, MGuerrero, JALu, YStrickley, RGVenkataramani, CZablocki, J Compounds for the treatment of addiction US Patent  US10507215 Publication Date 12/17/2019 
Target
Name:
Amine oxidase [flavin-containing] A
Synonyms:
AOFA_HUMAN MAO-A Monoamine oxidase Monoamine oxidase type A (MAO A) Monoamine oxidase type A (MAOA)
Type:
Protein
Mol. Mass.:
59689.53
Organism:
Homo sapiens (Human)
Description:
P21397
Residue:
527
  
Inhibitor
Name:
BDBM153692
Synonyms:
US10507215, Compound 9 US9610299, Example 9
Type:
Small organic molecule
Emp. Form.:
C20H16Cl2N2O2
Mol. Mass.:
387.259
SMILES:
Cn1ccc(cc1=O)-c1ccc(CNC(=O)c2c(Cl)cccc2Cl)cc1
: