Target
Aldehyde dehydrogenase, mitochondrial
Ligand
BDBM153693
Substrate
Meas. Tech.
ALDH2 Assay
IC50
890±n/a nM
Citation
 Cannizzaro, CEGraupe, MGuerrero, JALu, YStrickley, RGVenkataramani, CZablocki, J Compounds for the treatment of addiction US Patent  US10507215 Publication Date 12/17/2019 
Target
Name:
Aldehyde dehydrogenase, mitochondrial
Synonyms:
ALDH class 2 ALDH2 ALDHI Aldehyde dehydrogenase (ALDH2)
Type:
Enzyme
Mol. Mass.:
56382.67
Organism:
Homo sapiens (Human)
Description:
P05091
Residue:
517
  
Inhibitor
Name:
BDBM153693
Synonyms:
US10507215, Compound 10 US9610299, Example 10
Type:
Small organic molecule
Emp. Form.:
C19H14F2N2O2
Mol. Mass.:
340.3235
SMILES:
Fc1cccc(F)c1C(=O)NCc1ccc(cc1)-c1cc[nH]c(=O)c1
: