Target
Aldehyde dehydrogenase, mitochondrial
Ligand
BDBM153695
Substrate
Meas. Tech.
ALDH2 Assay
IC50
304±n/a nM
Citation
 Cannizzaro, CEGraupe, MGuerrero, JALu, YStrickley, RGVenkataramani, CZablocki, J Compounds for the treatment of addiction US Patent  US10507215 Publication Date 12/17/2019 
Target
Name:
Aldehyde dehydrogenase, mitochondrial
Synonyms:
ALDH class 2 ALDH2 ALDHI Aldehyde dehydrogenase (ALDH2)
Type:
Enzyme
Mol. Mass.:
56382.67
Organism:
Homo sapiens (Human)
Description:
P05091
Residue:
517
  
Inhibitor
Name:
BDBM153695
Synonyms:
US10507215, Compound 12 US9610299, Example 12
Type:
Small organic molecule
Emp. Form.:
C19H13Cl2FN2O2
Mol. Mass.:
391.223
SMILES:
Fc1cc(ccc1CNC(=O)c1c(Cl)cccc1Cl)-c1cc[nH]c(=O)c1
: