Target
Amine oxidase [flavin-containing] A
Ligand
BDBM153695
Substrate
Meas. Tech.
MAO-A and MAO-B Assays
IC50
>130000±n/a nM
Citation
 Cannizzaro, CEGraupe, MGuerrero, JALu, YStrickley, RGVenkataramani, CZablocki, J Compounds for the treatment of addiction US Patent  US10507215 Publication Date 12/17/2019 
Target
Name:
Amine oxidase [flavin-containing] A
Synonyms:
AOFA_HUMAN MAO-A Monoamine oxidase Monoamine oxidase type A (MAO A) Monoamine oxidase type A (MAOA)
Type:
Protein
Mol. Mass.:
59689.53
Organism:
Homo sapiens (Human)
Description:
P21397
Residue:
527
  
Inhibitor
Name:
BDBM153695
Synonyms:
US10507215, Compound 12 US9610299, Example 12
Type:
Small organic molecule
Emp. Form.:
C19H13Cl2FN2O2
Mol. Mass.:
391.223
SMILES:
Fc1cc(ccc1CNC(=O)c1c(Cl)cccc1Cl)-c1cc[nH]c(=O)c1
: