Target
Tumor necrosis factor
Ligand
BDBM422045
Substrate
Meas. Tech.
Cellular Necrosis Inhibition Activity
EC50
26.8±n/a nM
Citation
 Yuan, JZhou, YQian, SMa, D Inhibitors of cellular necrosis and related methods US Patent  US10508102 Publication Date 12/17/2019 
Target
Name:
Tumor necrosis factor
Synonyms:
Cachectin TNF-a TNFA TNFSF2 Tumor necrosis factor (TNFa) Tumor necrosis factor ligand superfamily member 2 Tumor necrosis factor, soluble form | tumor necrosis factor alpha
Type:
Enzyme
Mol. Mass.:
25645.11
Organism:
Homo sapiens (Human)
Description:
P01375
Residue:
233
  
Inhibitor
Name:
BDBM422045
Synonyms:
US10508102, Compound (Ia)
Type:
Small organic molecule
Emp. Form.:
C13H11ClFN3O2
Mol. Mass.:
295.697
SMILES:
CN1C(=O)N[C@H](Cc2c[nH]c3c(Cl)c(F)ccc23)C1=O
: