Target
Tumor necrosis factor
Ligand
BDBM422046
Substrate
Meas. Tech.
Cellular Necrosis Inhibition Activity
EC50
90.5±n/a nM
Citation
 Yuan, JZhou, YQian, SMa, D Inhibitors of cellular necrosis and related methods US Patent  US10508102 Publication Date 12/17/2019 
Target
Name:
Tumor necrosis factor
Synonyms:
Cachectin TNF-a TNFA TNFSF2 Tumor necrosis factor (TNFa) Tumor necrosis factor ligand superfamily member 2 Tumor necrosis factor, soluble form | tumor necrosis factor alpha
Type:
Enzyme
Mol. Mass.:
25645.11
Organism:
Homo sapiens (Human)
Description:
P01375
Residue:
233
  
Inhibitor
Name:
BDBM422046
Synonyms:
US10508102, Compound A
Type:
Small organic molecule
Emp. Form.:
C8H5ClFN
Mol. Mass.:
169.583
SMILES:
Fc1ccc2cc[nH]c2c1Cl
: