Target
Tumor necrosis factor
Ligand
BDBM422051
Substrate
Meas. Tech.
Cellular Necrosis Inhibition Activity
EC50
159±n/a nM
Citation
 Yuan, JZhou, YQian, SMa, D Inhibitors of cellular necrosis and related methods US Patent  US10508102 Publication Date 12/17/2019 
Target
Name:
Tumor necrosis factor
Synonyms:
Cachectin TNF-a TNFA TNFSF2 Tumor necrosis factor (TNFa) Tumor necrosis factor ligand superfamily member 2 Tumor necrosis factor, soluble form | tumor necrosis factor alpha
Type:
Enzyme
Mol. Mass.:
25645.11
Organism:
Homo sapiens (Human)
Description:
P01375
Residue:
233
  
Inhibitor
Name:
BDBM422051
Synonyms:
5-((7-chloro-1H-indol-3-yl)methyl)- 3-(2-fluorobenzyl)imidazolidine-2,4- dione | US10508102, Example II-1
Type:
Small organic molecule
Emp. Form.:
C19H15ClFN3O2
Mol. Mass.:
371.793
SMILES:
Fc1ccccc1CN1C(=O)NC(Cc2c[nH]c3c(Cl)cccc23)C1=O
: