Target
Baculoviral IAP repeat-containing protein 3 [238-349]
Ligand
BDBM422063
Substrate
Meas. Tech.
Biological Assay 1: affinity of compounds to cIAP1-BIR3, cIAP2-BIR3, XIAP-BIR3
IC50
55.0±n/a nM
Citation
 Sun, FDing, CZCai, ZQian, WHu, GLi, JChen, S Benzimidazole-linked indole compound acting as novel divalent IAP antagonist US Patent  US10508103 Publication Date 12/17/2019 
Target
Name:
Baculoviral IAP repeat-containing protein 3 [238-349]
Synonyms:
API2 BIRC3 Baculoviral IAP repeat-containing protein 3 Inhibitor of apoptosis protein 1 RNF49 cIAP-2 BIR3
Type:
BIR3 domain
Mol. Mass.:
12945.93
Organism:
Homo sapiens (Human)
Description:
Human cIAP2 BIR3 domain (residues 238-349) was used in binding assays.
Residue:
112
  
Inhibitor
Name:
BDBM422063
Synonyms:
US10508103, Embodiment 16
Type:
Small organic molecule
Emp. Form.:
C43H57F4N9O4
Mol. Mass.:
839.9642
SMILES:
CN[C@@H](C)C(=O)N[C@@H](C(C)C)C(=O)N1C[C@@H](F)C[C@H]1Cc1c([nH]c2cc(F)ccc12)-c1nc2cc(F)ccc2n1C[C@@H]1C[C@H](F)CN1C(=O)[C@@H](NC(=O)[C@H](C)NC)C(C)C
: