Target
Activin receptor type-1B
Ligand
BDBM280366
Substrate
Meas. Tech.
In Vitro Kinase Assay
IC50
2.70±n/a nM
Citation
 Rai, RChakravarty, SPujala, BShinde, BUNayak, AKChaklan, NAgarwal, AKRamachandran, SAPham, SM Compounds and methods of use US Patent  US10501436 Publication Date 12/10/2019 
Target
Name:
Activin receptor type-1B
Synonyms:
ACV1B_HUMAN ACVRLK4 Activin receptor type-1B/Activin receptor-like kinase 4 (ALK-4)
Type:
PROTEIN
Mol. Mass.:
56810.99
Organism:
Homo sapiens (Human)
Description:
ChEMBL_587064
Residue:
505
  
Inhibitor
Name:
BDBM280366
Synonyms:
2-(5-chloro-2-fluorophenyl)-5-cyclopropyl-N-{1H-pyrrolo[2,3-b]pyridin-4-yl}pyridin-4-amine US10501436, Compound 32 US11702401, Compound 32
Type:
Small organic molecule
Emp. Form.:
C21H16ClFN4
Mol. Mass.:
378.83
SMILES:
Fc1ccc(Cl)cc1-c1cc(Nc2ccnc3[nH]ccc23)c(cn1)C1CC1
: