Target
Bromodomain-containing protein 4
Ligand
BDBM423152
Substrate
Meas. Tech.
In Vitro Bromodomain Inhibition Assay
IC50
560±n/a nM
Citation
 Jacquemot, GBayrakdarian, MJohnstone, SAlbert, JSGriffin, A Aryl-substituted dihydroquinolinones, their preparation and their use as pharmaceuticals US Patent  US10501438 Publication Date 12/10/2019 
Target
Name:
Bromodomain-containing protein 4
Synonyms:
BRD4 Bromodomain-containing protein 4 (BRD4) Protein HUNK1
Type:
Protein
Mol. Mass.:
152264.84
Organism:
Homo sapiens (Human)
Description:
O60885
Residue:
1362
  
Inhibitor
Name:
BDBM423152
Synonyms:
US10501438, Compound 2
Type:
Small organic molecule
Emp. Form.:
C24H24N2O2
Mol. Mass.:
372.4596
SMILES:
CN1C(=O)CCc2cc(cc(Cc3ccccc3)c12)-c1cc(C)c(=O)n(C)c1
: