Target
Bromodomain-containing protein 4
Ligand
BDBM423153
Substrate
Meas. Tech.
In Vitro Bromodomain Inhibition Assay
IC50
510±n/a nM
Citation
 Jacquemot, GBayrakdarian, MJohnstone, SAlbert, JSGriffin, A Aryl-substituted dihydroquinolinones, their preparation and their use as pharmaceuticals US Patent  US10501438 Publication Date 12/10/2019 
Target
Name:
Bromodomain-containing protein 4
Synonyms:
BRD4 Bromodomain-containing protein 4 (BRD4) Protein HUNK1
Type:
Protein
Mol. Mass.:
152264.84
Organism:
Homo sapiens (Human)
Description:
O60885
Residue:
1362
  
Inhibitor
Name:
BDBM423153
Synonyms:
US10501438, Compound 3
Type:
Small organic molecule
Emp. Form.:
C22H21N3O2
Mol. Mass.:
359.421
SMILES:
Cc1cc(cn(C)c1=O)-c1cc2CCC(=O)Nc2c(Nc2ccccc2)c1
: