Target
Bromodomain-containing protein 4
Ligand
BDBM423168
Substrate
Meas. Tech.
In Vitro Bromodomain Inhibition Assay
IC50
180±n/a nM
Citation
 Jacquemot, GBayrakdarian, MJohnstone, SAlbert, JSGriffin, A Aryl-substituted dihydroquinolinones, their preparation and their use as pharmaceuticals US Patent  US10501438 Publication Date 12/10/2019 
Target
Name:
Bromodomain-containing protein 4
Synonyms:
BRD4 Bromodomain-containing protein 4 (BRD4) Protein HUNK1
Type:
Protein
Mol. Mass.:
152264.84
Organism:
Homo sapiens (Human)
Description:
O60885
Residue:
1362
  
Inhibitor
Name:
BDBM423168
Synonyms:
6-(1,5-dimethyl-6-oxo-3-pyridyl)-8-(N-methylanilino)-3,4-dihydro-1H-quinolin-2-one | US10501438, Compound 17
Type:
Small organic molecule
Emp. Form.:
C23H22N2O3
Mol. Mass.:
374.4324
SMILES:
Cc1cc(cn(C)c1=O)-c1cc2CCC(=O)Nc2c(OCc2ccccc2)c1
: