Target
Bromodomain-containing protein 4
Ligand
BDBM423164
Substrate
Meas. Tech.
In Vitro Bromodomain Inhibition Assay
IC50
420±n/a nM
Citation
 Jacquemot, GBayrakdarian, MJohnstone, SAlbert, JSGriffin, A Aryl-substituted dihydroquinolinones, their preparation and their use as pharmaceuticals US Patent  US10501438 Publication Date 12/10/2019 
Target
Name:
Bromodomain-containing protein 4
Synonyms:
BRD4 Bromodomain-containing protein 4 (BRD4) Protein HUNK1
Type:
Protein
Mol. Mass.:
152264.84
Organism:
Homo sapiens (Human)
Description:
O60885
Residue:
1362
  
Inhibitor
Name:
BDBM423164
Synonyms:
6-(1,5-dimethyl-6-oxo-3-pyridyl)-8-(tetrahydropyran-4-ylamino)-3,4-dihydro-1H-quinolin-2-one | US10501438, Compound 18
Type:
Small organic molecule
Emp. Form.:
C21H25N3O3
Mol. Mass.:
367.4415
SMILES:
Cc1cc(cn(C)c1=O)-c1cc2CCC(=O)Nc2c(NC2CCOCC2)c1
: