Target
Bromodomain-containing protein 4
Ligand
BDBM423165
Substrate
Meas. Tech.
In Vitro Bromodomain Inhibition Assay
IC50
700±n/a nM
Citation
 Jacquemot, GBayrakdarian, MJohnstone, SAlbert, JSGriffin, A Aryl-substituted dihydroquinolinones, their preparation and their use as pharmaceuticals US Patent  US10501438 Publication Date 12/10/2019 
Target
Name:
Bromodomain-containing protein 4
Synonyms:
BRD4 Bromodomain-containing protein 4 (BRD4) Protein HUNK1
Type:
Protein
Mol. Mass.:
152264.84
Organism:
Homo sapiens (Human)
Description:
O60885
Residue:
1362
  
Inhibitor
Name:
BDBM423165
Synonyms:
US10501438, Compound 19
Type:
Small organic molecule
Emp. Form.:
C22H27N3O2
Mol. Mass.:
365.4687
SMILES:
Cc1cc(cn(C)c1=O)-c1cc(CNC2CCCC2)c2NC(=O)CCc2c1
: