Target
Poly [ADP-ribose] polymerase 1
Ligand
BDBM207573
Substrate
Meas. Tech.
Enzymatic Assay
IC50
6000±n/a nM
Citation
 Zhou, CRen, BWang, H Fused tetra or penta-cyclic dihydrodiazepinocarbazolones as PARP inhibitors US Patent  US10501467 Publication Date 12/10/2019 
Target
Name:
Poly [ADP-ribose] polymerase 1
Synonyms:
(ARTD1 or PARP1) 2.4.2.30 ADPRT ARTD1 Human diphtheria toxin-like ADP-ribosyltransferase (ARTD1 or PARP1) NT-PARP-1 PARP1 PPOL Poly [ADP-ribose] polymerase 1 (PARP) Poly [ADP-ribose] polymerase 1 (PARP1) Poly [ADP-ribose] polymerase 1, 28-kDa form Poly [ADP-ribose] polymerase 1, processed C-terminus Poly [ADP-ribose] polymerase-1 Poly(ADP-ribose) polymerase-1 (ARTD1/PARP1) Protein poly-ADP-ribosyltransferase PARP1 | Synonyms=ADPRT
Type:
Mol. Mass.:
113114.22
Organism:
Homo sapiens (Human)
Description:
P09874
Residue:
1014
  
Inhibitor
Name:
BDBM207573
Synonyms:
US10501467, Example 18 US9617273, Example 18
Type:
Small organic molecule
Emp. Form.:
C14H12FN3O
Mol. Mass.:
257.263
SMILES:
CC1Cc2[nH]c3cc(F)cc4c3c2c(C1)n[nH]c4=O
: