Target
Dual specificity calcium/calmodulin-dependent 3',5'-cyclic nucleotide phosphodiesterase 1B
Ligand
BDBM279105
Substrate
Meas. Tech.
PDE1 Inhibition Assay
IC50
12.0±n/a nM
Citation
 Kehler, JJuhl, KMarigo, MVital, PJJessing, MLanggård, MRasmussen, LKClementson, CM 1 H-pyrazolo[4,3-B]pyridines as PDE1 inhibitors US Patent  US10512632 Publication Date 12/24/2019 
Target
Name:
Dual specificity calcium/calmodulin-dependent 3',5'-cyclic nucleotide phosphodiesterase 1B
Synonyms:
63 kDa Cam-PDE Calcium/calmodulin-dependent 3',5'-cyclic nucleotide phosphodiesterase 1B PDE1B PDE1B_HUMAN Phosphodiesterase 1B Phosphodiesterase Type 1 (PDE1B) | Phosphodiesterase, PDE1/PDE5
Type:
Enzyme
Mol. Mass.:
61366.51
Organism:
Homo sapiens (Human)
Description:
Residue:
536
  
Inhibitor
Name:
BDBM279105
Synonyms:
5-(2-ethoxy-3-pyridyl)-1-[1-methylpropyl]-N-(1H-pyrazol-3-ylmethyl)pyrazolo[4,3-b]pyridin-7-amine, enantiomer 1 US10034861, Example 137 US10766893, Example S137 US11026923, Example 137 US11634416, Example 137
Type:
Small organic molecule
Emp. Form.:
C21H25N7O
Mol. Mass.:
391.4695
SMILES:
CCOc1ncccc1-c1cc(NCc2cc[nH]n2)c2n(ncc2n1)C(C)CC
: