Target
Cyclin-A2/Cyclin-dependent kinase 2
Ligand
BDBM6878
Substrate
CDK2 biotinylated peptide substrate
Meas. Tech.
Kinase Inhibition Assay
IC50
0.5±n/a nM
Citation
 Lin, RConnolly, PJHuang, SWetter, SKLu, YMurray, WVEmanuel, SLGruninger, RHFuentes-Pesquera, ARRugg, CAMiddleton, SAJolliffe, LK 1-Acyl-1H-[1,2,4]triazole-3,5-diamine analogues as novel and potent anticancer cyclin-dependent kinase inhibitors: synthesis and evaluation of biological activities. J Med Chem 48:4208-11 (2005)  
Target
Name:
Cyclin-A2/Cyclin-dependent kinase 2
Synonyms:
CDK2-CyclinA CDK2/Cyclin A Cyclin A2/dependent kinase 2 Cyclin-Dependent Kinase 2 (CDK2A)
Type:
Protein Complex
Mol. Mass.:
Description:
Cdk2/Cyclin A kinase was purified from insect cells coinfected with Cyclin A/Cdk2 baculovirus.
Components:
This complex has 2 components.
Component 1
Name:
Cyclin-dependent kinase 2
Synonyms:
CDK2 CDK2_HUMAN Cell division protein kinase 2 Protein cereblon/Cyclin-dependent kinase 2 | p33 protein kinase
Type:
Enzyme Subunit
Mol. Mass.:
33938.17
Organism:
Homo sapiens (Human)
Description:
P24941
Residue:
298
  
Component 2
Name:
Cyclin-A2
Synonyms:
CCN1 CCNA1 CCNA2_HUMAN Cyclin-A
Type:
Enzyme Subunit
Mol. Mass.:
48550.19
Organism:
Homo sapiens (Human)
Description:
P20248
Residue:
432
  
Inhibitor
Name:
BDBM6878
Synonyms:
1-Acyl-1H-[1,2,4]triazole-3,5-diamine Analogue 3n | 5-amino-N-(2,6-difluorophenyl)-3-[(4-sulfamoylphenyl)amino]-1H-1,2,4-triazole-1-carbothioamide
Type:
Small organic molecule
Emp. Form.:
C15H13F2N7O2S2
Mol. Mass.:
425.436
SMILES:
Nc1nc(Nc2ccc(cc2)S(N)(=O)=O)nn1C(=S)Nc1c(F)cccc1F
:
Substrate
Name:
CDK2 biotinylated peptide substrate
Synonyms:
Type:
Peptide
Mol. Mass.:
3057.82
Organism:
Description:
Residue:
27