Target
Non-receptor tyrosine-protein kinase TYK2
Ligand
BDBM425122
Substrate
Meas. Tech.
Biochemical JAK Kinase Assays
Ki
1.000±n/a nM
Citation
 Fatheree, PRBrandt, GESmith, CSullivan, SDVan Orden, LJKleinschek, MACrater, GD Fused imidazo-piperidine JAK inhibitors US Patent  US10519153 Publication Date 12/31/2019 
Target
Name:
Non-receptor tyrosine-protein kinase TYK2
Synonyms:
Non-receptor tyrosine-protein kinase TYK2 (TYK2) TYK2_HUMAN | Tyrosine-protein kinase TYK2
Type:
Protein
Mol. Mass.:
133666.03
Organism:
Homo sapiens (Human)
Description:
P29597
Residue:
1187
  
Inhibitor
Name:
BDBM425122
Synonyms:
US10519153, Example 9-21
Type:
Small organic molecule
Emp. Form.:
C31H40FN7O
Mol. Mass.:
545.694
SMILES:
CCc1cc(O)c(F)cc1-c1ccc2c(n[nH]c2c1)-c1nc2C[C@@H](CN3CC[C@@H](C3)N(C)C)N(Cc2[nH]1)C(C)C
: