Target
Ectonucleotide pyrophosphatase/phosphodiesterase family member 2
Ligand
BDBM192920
Substrate
IC50
50±n/a nM
Citation
 Desroy, NHeckmann, BBrys, RCJoncour, AMPeixoto, CBock, XM Compounds and pharmaceutical compositions thereof for the treatment of inflammatory disorders US Patent  US10526329 Publication Date 1/7/2020 
Target
Name:
Ectonucleotide pyrophosphatase/phosphodiesterase family member 2
Synonyms:
ATX Autotaxin (ATX) ENPP2 Ectonucleotide Pyrophosphatase/Phosphodiesterase 2 (ENPP2) Extracellular lysophospholipase D PDNP2
Type:
Enzyme
Mol. Mass.:
99007.13
Organism:
Homo sapiens (Human)
Description:
Q13822
Residue:
863
  
Inhibitor
Name:
BDBM192920
Synonyms:
US10526329, Compound 134 US9670204, 134 1-(3-(4-(2-ethyl-3-((4-(4-fluorophenyl)thiazol-2-yl)(methyl)amino)imidazo[1,2-a]pyridin-6-yl)piperidin-1-yl)azetidin-1-yl)ethanone
Type:
Small organic molecule
Emp. Form.:
C29H33FN6OS
Mol. Mass.:
532.675
SMILES:
CCc1nc2ccc(cn2c1N(C)c1nc(cs1)-c1ccc(F)cc1)C1CCN(CC1)C1CN(C1)C(C)=O
: