Target
Calmodulin-domain protein kinase 1
Ligand
BDBM50389700
Substrate
Meas. Tech.
luminescent kinase assay
IC50
0.700±n/a nM
Citation
 Van Voorhis, WCHol, WGLarson, ETMaly, DJMerritt, EOjo, KK Compositions and methods for treating toxoplasmosis, cryptosporidiosis, and other apicomplexan protozoan related diseases US Patent  US10544104 Publication Date 1/28/2020 
Target
Name:
Calmodulin-domain protein kinase 1
Synonyms:
Calmodulin-domain protein kinase 1 Calmodulin-domain protein kinase, putative
Type:
Enzyme Catalytic Domain
Mol. Mass.:
57248.42
Organism:
Toxoplasma gondii
Description:
Residue:
507
  
Inhibitor
Name:
BDBM50389700
Synonyms:
CHEMBL2070067 US11247972, Compound 38 | US9765037, Compound 38
Type:
Small organic molecule
Emp. Form.:
C28H27ClN6O
Mol. Mass.:
499.007
SMILES:
Nc1ncnc2n(CC3CCNCC3)nc(-c3ccc4cc(OCc5cccc(Cl)c5)ccc4c3)c12
: