Target
Calmodulin-domain protein kinase 1
Ligand
BDBM50389699
Substrate
Meas. Tech.
luminescent kinase assay
IC50
5.50±n/a nM
Citation
 Van Voorhis, WCHol, WGLarson, ETMaly, DJMerritt, EOjo, KK Compositions and methods for treating toxoplasmosis, cryptosporidiosis, and other apicomplexan protozoan related diseases US Patent  US10544104 Publication Date 1/28/2020 
Target
Name:
Calmodulin-domain protein kinase 1
Synonyms:
Calmodulin-domain protein kinase 1 Calmodulin-domain protein kinase, putative
Type:
Enzyme Catalytic Domain
Mol. Mass.:
57248.42
Organism:
Toxoplasma gondii
Description:
Residue:
507
  
Inhibitor
Name:
BDBM50389699
Synonyms:
CHEMBL2070066 US11247972, Compound 47 | US9765037, Compound 47
Type:
Small organic molecule
Emp. Form.:
C25H22ClN5O
Mol. Mass.:
443.928
SMILES:
CC(C)n1nc(-c2ccc3cc(OCc4cccc(Cl)c4)ccc3c2)c2c(N)ncnc12
: