Target
Prokineticin receptor 1
Ligand
BDBM250588
Substrate
Meas. Tech.
BIOLOGICAL ASSAY
IC50
520±n/a nM
Citation
 Carroll, CGoldby, ATeall, M Sulfonyl piperidine derivatives and their use for treating prokineticin mediated diseases US Patent  US10544126 Publication Date 1/28/2020 
Target
Name:
Prokineticin receptor 1
Synonyms:
G-protein coupled receptor 73 GPR73 PK-R1 PKR1_HUMAN | PROKR1
Type:
enzyme
Mol. Mass.:
44779.92
Organism:
Homo sapiens (Human)
Description:
Q8TCW9
Residue:
393
  
Inhibitor
Name:
BDBM250588
Synonyms:
US10167273, Example 67 US11512066, Example 67 | US9475795, 67
Type:
Small organic molecule
Emp. Form.:
C17H22ClN3O2S
Mol. Mass.:
367.893
SMILES:
Cc1n[nH]c(C)c1S(=O)(=O)N1CCC(Cc2ccc(Cl)cc2)CC1
: