Target
Proto-oncogene Wnt-1
Ligand
BDBM293415
Substrate
Meas. Tech.
The screening assay for Wnt activity
EC50
67.0±n/a nM
Citation
 KC, SKMak, CCEastman, BWCao, JBollu, VMittapalli, GKChiruta, C Isoquinolin-3-yl carboxamides and preparation and use thereof US Patent  US10544128 Publication Date 1/28/2020 
Target
Name:
Proto-oncogene Wnt-1
Synonyms:
INT1 WNT1 | WNT1_HUMAN
Type:
Enzyme Catalytic Domain
Mol. Mass.:
41006.01
Organism:
Homo sapiens (human)
Description:
P04628
Residue:
370
  
Inhibitor
Name:
BDBM293415
Synonyms:
US10106527, Compound 1 US10544128, Compound 145 US20230286945, Compound 145 | US9951048, Compound 145
Type:
Small organic molecule
Emp. Form.:
C23H23N7O
Mol. Mass.:
413.475
SMILES:
CN1CCN(CC1)c1cc(ccn1)C(=O)Nc1cc2cc(ccc2cn1)-c1cn[nH]c1
: