Target
Proto-oncogene Wnt-1
Ligand
BDBM293423
Substrate
Meas. Tech.
The screening assay for Wnt activity
EC50
39.0±n/a nM
Citation
 KC, SKMak, CCEastman, BWCao, JBollu, VMittapalli, GKChiruta, C Isoquinolin-3-yl carboxamides and preparation and use thereof US Patent  US10544128 Publication Date 1/28/2020 
Target
Name:
Proto-oncogene Wnt-1
Synonyms:
INT1 WNT1 | WNT1_HUMAN
Type:
Enzyme Catalytic Domain
Mol. Mass.:
41006.01
Organism:
Homo sapiens (human)
Description:
P04628
Residue:
370
  
Inhibitor
Name:
BDBM293423
Synonyms:
US10106527, Compound 461 US10544128, Compound 9 US20230286945, Compound 461 | US9951048, Compound 461
Type:
Small organic molecule
Emp. Form.:
C23H23N7O
Mol. Mass.:
413.475
SMILES:
Cn1cc(cn1)-c1ccc2cnc(NC(=O)c3ccnc(c3)N3CCNCC3)cc2c1
: