Target
Proto-oncogene Wnt-1
Ligand
BDBM293633
Substrate
Meas. Tech.
The screening assay for Wnt activity
EC50
47.0±n/a nM
Citation
 KC, SKMak, CCEastman, BWCao, JBollu, VMittapalli, GKChiruta, C Isoquinolin-3-yl carboxamides and preparation and use thereof US Patent  US10544128 Publication Date 1/28/2020 
Target
Name:
Proto-oncogene Wnt-1
Synonyms:
INT1 WNT1 | WNT1_HUMAN
Type:
Enzyme Catalytic Domain
Mol. Mass.:
41006.01
Organism:
Homo sapiens (human)
Description:
P04628
Residue:
370
  
Inhibitor
Name:
BDBM293633
Synonyms:
US10106527, Compound 431 US11548872, Compound 431 US9951048, Compound 431
Type:
Small organic molecule
Emp. Form.:
C22H22N8O
Mol. Mass.:
414.4631
SMILES:
Cn1cc(nn1)-c1ccc2cnc(NC(=O)c3ccnc(c3)N3CCNCC3)cc2c1
: