Target
Glycogen synthase kinase-3 beta
Ligand
BDBM293441
Substrate
Meas. Tech.
The GSK3beta kinase assay
EC50
>10000±n/a nM
Citation
 KC, SKMak, CCEastman, BWCao, JBollu, VMittapalli, GKChiruta, C Isoquinolin-3-yl carboxamides and preparation and use thereof US Patent  US10544128 Publication Date 1/28/2020 
Target
Name:
Glycogen synthase kinase-3 beta
Synonyms:
GSK-3 beta GSK3B Glycogen synthase kinase 3 beta (GSK3B) Glycogen synthase kinase-3 beta (GSK-3B) Glycogen synthase kinase-3 beta (GSK3B) Glycogen synthase kinase-3beta (GSK3B) | Serine/threonine-protein kinase GSK3B
Type:
Enzyme
Mol. Mass.:
46756.38
Organism:
Homo sapiens (Human)
Description:
P49841
Residue:
420
  
Inhibitor
Name:
BDBM293441
Synonyms:
US10106527, Compound 27 US11548872, Compound 27 US9951048, Compound 27
Type:
Small organic molecule
Emp. Form.:
C26H27N7O2
Mol. Mass.:
469.5383
SMILES:
CNC(=O)c1ccc(cn1)C(=O)Nc1cc2cc(ccc2cn1)-c1cnn(c1)C1CCN(C)CC1
: