Target
Toll-like receptor 8
Ligand
BDBM427673
Substrate
Meas. Tech.
TLR7/8/9 Inhibition Reporter Assays
IC50
0.150±n/a nM
Citation
 Dyckman, AJDodd, DSMussari, CPKumar, SR 4-azaindole compounds US Patent  US10544143 Publication Date 1/28/2020 
Target
Name:
Toll-like receptor 8
Synonyms:
CD_antigen: CD288 TLR8_HUMAN | TRL8
Type:
Enzyme
Mol. Mass.:
119828.77
Organism:
Homo sapiens (Human)
Description:
Q9NR97
Residue:
1041
  
Inhibitor
Name:
BDBM427673
Synonyms:
1-(4-(2-(7,8-dimethyl-[1,2,4]triazolo[1,5-a]pyridin-6-yl)-3-isopropyl-1H-pyrrolo[3,2-b]pyridin-5-yl)piperazin-1-yl)-2-methylpropan-2-ol US10730877, Example 105 | US11053244, Example 105
Type:
Small organic molecule
Emp. Form.:
C26H35N7O
Mol. Mass.:
461.6024
SMILES:
CC(C)c1c([nH]c2ccc(nc12)N1CCN(CC(C)(C)O)CC1)-c1cn2ncnc2c(C)c1C
: