Target
Toll-like receptor 9
Ligand
BDBM427762
Substrate
Meas. Tech.
TLR7/8/9 Inhibition Reporter Assays
IC50
1189±n/a nM
Citation
 Dyckman, AJDodd, DSMussari, CPKumar, SR 4-azaindole compounds US Patent  US10544143 Publication Date 1/28/2020 
Target
Name:
Toll-like receptor 9
Synonyms:
CD_antigen: CD289 TLR9_HUMAN
Type:
Enzyme
Mol. Mass.:
115889.91
Organism:
Homo sapiens (Human)
Description:
Q9NR96
Residue:
1032
  
Inhibitor
Name:
BDBM427762
Synonyms:
US10544143, Example 195 | US10544143, Example 199
Type:
Small organic molecule
Emp. Form.:
C27H34N6O
Mol. Mass.:
458.5985
SMILES:
COc1cc(cn2ncnc12)-c1[nH]c2ccc(nc2c1C(C)C)C1CCC(CC1)N1CCCC1
: