Target
Toll-like receptor 8
Ligand
BDBM428465
Substrate
Meas. Tech.
TLR7/8/9 Inhibition Reporter Assays
IC50
0.150±n/a nM
Citation
 Dyckman, AJDodd, DSMussari, CPKumar, SR 4-azaindole compounds US Patent  US10544143 Publication Date 1/28/2020 
Target
Name:
Toll-like receptor 8
Synonyms:
CD_antigen: CD288 TLR8_HUMAN | TRL8
Type:
Enzyme
Mol. Mass.:
119828.77
Organism:
Homo sapiens (Human)
Description:
Q9NR97
Residue:
1041
  
Inhibitor
Name:
BDBM428465
Synonyms:
US10544143, Example 901 US11053244, Example 901
Type:
Small organic molecule
Emp. Form.:
C30H38N8O2
Mol. Mass.:
542.6751
SMILES:
CC(C)c1c([nH]c2ccc(nc12)N1CCN(C[C@@H]1C)C(=O)CN1CC2(COC2)C1)-c1cn2ncnc2c(C)c1C
: