Target
Tyrosine-protein kinase SYK
Ligand
BDBM100350
Substrate
Meas. Tech.
Kinase Assay
Kd
4.50±n/a nM
Citation
 Bauer, SMJia, ZJMehrotra, MSong, YXu, QHuang, WVenkataramani, CRose, JWPandey, A Inhibitors of protein kinases US Patent  US10533001 Publication Date 1/14/2020 
Target
Name:
Tyrosine-protein kinase SYK
Synonyms:
KSYK_HUMAN Spleen Tyrosine Kinase Tyrosine-protein kinase SYK (Syk)
Type:
Enzyme
Mol. Mass.:
72079.99
Organism:
Homo sapiens (Human)
Description:
P43405
Residue:
635
  
Inhibitor
Name:
BDBM100350
Synonyms:
US10533001, Example 99 US8501944, 372 US9868729, Example 99
Type:
Small organic molecule
Emp. Form.:
C19H25N7O3S
Mol. Mass.:
431.512
SMILES:
CS(=O)(=O)N1CCN(CC1)c1ccc(Nc2ncc(C(N)=O)c(NC3CC3)n2)cc1
: