Target
Spike glycoprotein
Ligand
BDBM50017696
Substrate
Meas. Tech.
No assay is provided
IC50
21430±n/a nM
Citation
 Pillaiyar, TWendt, LLManickam, MEaswaran, M The recent outbreaks of human coronaviruses: A medicinal chemistry perspective. Med Res Rev 0:0 (2020)  
Target
Name:
Spike glycoprotein
Synonyms:
E2 S SPIKE_SARS
Type:
Protein
Mol. Mass.:
139114.99
Organism:
SARS-CoV
Description:
P59594
Residue:
1255
  
Inhibitor
Name:
BDBM50017696
Synonyms:
(2-dimethylamino-2-methyl)ethyl-N-dibenzoparathiazine 10-[2-(dimethylamino)propyl]phenothiazine N,N,alpha-trimethyl-10H-phenothiazine-10-ethanamine PROMETHAZINE proazamine
Type:
Small organic molecule
Emp. Form.:
C17H20N2S
Mol. Mass.:
284.419
SMILES:
CC(CN1c2ccccc2Sc2ccccc12)N(C)C
: