Target
Replicase polyprotein 1ab
Ligand
BDBM50080528
Substrate
Meas. Tech.
No assay is provided
EC50
40±n/a nM
Citation
 Pillaiyar, TWendt, LLManickam, MEaswaran, M The recent outbreaks of human coronaviruses: A medicinal chemistry perspective. Med Res Rev 0:0 (2020)  
Target
Name:
Replicase polyprotein 1ab
Synonyms:
3C-like proteinase 3C-like proteinase (SARS-CoV 3Cpro) 3CLp GFL Guanine-N7 methyltransferase Helicase Leader protein Non-structural protein 10 Non-structural protein 3 Non-structural protein 6 Non-structural protein 8 ORF1ab polyprotein PL2-PRO Pol R1AB_SARS RdRp SARS coronavirus main proteinase nsp1 nsp12 nsp14 nsp16 nsp3 nsp5 nsp7 nsp9 pp1ab | rep
Type:
Protein
Mol. Mass.:
790250.81
Organism:
Human SARS coronavirus (SARS-CoV) (Severe acute respiratory syndrome coronavirus)
Description:
P0C6X7
Residue:
7073
  
Inhibitor
Name:
BDBM50080528
Synonyms:
3-((R)-2-((1S,3S,5S)-3,5-dimethyl-2-oxocyclohexyl)-2-hydroxyethyl)glutarimide CHEMBL123292 Zykloheximid cycloheximide | med.21724, Compound Cycloheximide
Type:
Small organic molecule
Emp. Form.:
C15H23NO4
Mol. Mass.:
281.3474
SMILES:
C[C@H]1C[C@H](C)C(=O)[C@@H](C1)[C@H](O)CC1CC(=O)NC(=O)C1
: