Target
Disintegrin and metalloproteinase domain-containing protein 17
Ligand
BDBM430278
Substrate
Meas. Tech.
TR-FRET Assay
IC50
5.60±n/a nM
Citation
 Ouvry, GHarris, CSBhurruth-Alcor, Y Benzenesulfonamide compounds, method for synthesizing same, and use thereof in medicine and cosmetics US Patent  US10556883 Publication Date 2/11/2020 
Target
Name:
Disintegrin and metalloproteinase domain-containing protein 17
Synonyms:
ADA17_HUMAN CSVP Disintegrin and metalloproteinase domain-containing protein 17 (ADAM17) TNF-alpha convertase TNF-alpha-converting enzyme (TACE) Tumor necrosis factor-α converting enzyme (TACE)
Type:
Enzyme
Mol. Mass.:
93007.89
Organism:
Homo sapiens (Human)
Description:
Residue:
824
  
Inhibitor
Name:
BDBM430278
Synonyms:
US10556883, Compound 28b
Type:
Small organic molecule
Emp. Form.:
C29H36N6O6S
Mol. Mass.:
596.698
SMILES:
CCN1CCN(CC1)C(=O)N1CC(CC(=O)NO)(C1)NS(=O)(=O)c1ccc(OCc2cc(C)nc3ccccc23)cc1
: