Target
Tyrosine-protein kinase JAK1
Ligand
BDBM431909
Substrate
Meas. Tech.
Biochemical JAK Kinase Assays
Ki
0.100±n/a nM
Citation
 Fatheree, PRBrandt, GESmith, CSullivan, SDVan Orden, LJKleinschek, MACrater, GD JAK inhibitors containing a 4-membered heterocyclic amide US Patent  US10550118 Publication Date 2/4/2020 
Target
Name:
Tyrosine-protein kinase JAK1
Synonyms:
JAK-1 JAK1A JAK1_HUMAN Janus kinase 1 (JAK1) | Janus kinase 1 JAK1
Type:
Protein
Mol. Mass.:
133293.73
Organism:
Homo sapiens (Human)
Description:
P23458
Residue:
1154
  
Inhibitor
Name:
BDBM431909
Synonyms:
US10550118, Example 8-16 US11453668, Example 8-16 | US11634419, Example C-4
Type:
Small organic molecule
Emp. Form.:
C31H38FN7O2
Mol. Mass.:
559.6775
SMILES:
CCc1cc(O)c(F)cc1-c1ccc2c(n[nH]c2c1)-c1nc2C[C@H](N(Cc2[nH]1)C(C)C)C(=O)N1CC(C)(C1)N(C)C
: