Target
Tyrosine-protein kinase JAK1
Ligand
BDBM333145
Substrate
Meas. Tech.
Biochemical JAK Kinase Assays
Ki
0.050±n/a nM
Citation
 Fatheree, PRBrandt, GESmith, CSullivan, SDVan Orden, LJKleinschek, MACrater, GD JAK inhibitors containing a 4-membered heterocyclic amide US Patent  US10550118 Publication Date 2/4/2020 
Target
Name:
Tyrosine-protein kinase JAK1
Synonyms:
JAK-1 JAK1A JAK1_HUMAN Janus kinase 1 (JAK1) | Janus kinase 1 JAK1
Type:
Protein
Mol. Mass.:
133293.73
Organism:
Homo sapiens (Human)
Description:
P23458
Residue:
1154
  
Inhibitor
Name:
BDBM333145
Synonyms:
(S)-(3-(dimethylamino)-3-methylazetidin-1-yl)(5-ethyl-2-(6-(2-ethyl-5-fluoro-4-hydroxyphenyl)-1H-indazol-3-yl)-4,5,6,7-tetrahydro-3H-imidazo[4,5-c]pyridin-6-yl)methanone US10550118, Example 8-23 US11453668, Example 8-23 | US11634419, Example C-3
Type:
Small organic molecule
Emp. Form.:
C30H36FN7O2
Mol. Mass.:
545.6509
SMILES:
CCN1Cc2[nH]c(nc2C[C@H]1C(=O)N1CC(C)(C1)N(C)C)-c1n[nH]c2cc(ccc12)-c1cc(F)c(O)cc1CC
: