Target
Integrin alpha-5/alpha-8
Ligand
BDBM432100
Substrate
Meas. Tech.
Solid Phase Receptor Assay (SPRA) for alpha8beta1 Function
IC50
40.0±n/a nM
Citation
 Ruminski, PGGriggs, DW Meta-azacyclic amino benzoic acid derivatives as pan integrin antagonists US Patent  US10577330 Publication Date 3/3/2020 
Target
Name:
Integrin alpha-5/alpha-8
Synonyms:
Integrin alpha8beta1
Type:
Protein
Mol. Mass.:
Description:
Components:
This complex has 2 components.
Component 1
Name:
Integrin alpha-5
Synonyms:
CD49 antigen-like family member E FNRA Fibronectin receptor subunit alpha ITGA5 Integrin alpha-F | VLA-5
Type:
Single-pass type I membrane protein
Mol. Mass.:
114523.00
Organism:
Homo sapiens (Human)
Description:
Residue:
1049
  
Component 2
Name:
Integrin alpha-8
Synonyms:
ITA8_HUMAN | ITGA8
Type:
Enzyme Catalytic Domain
Mol. Mass.:
117456.11
Organism:
Homo sapiens (Human)
Description:
Residue:
1063
  
Inhibitor
Name:
BDBM432100
Synonyms:
US10577330, Comparison Compound C9
Type:
Small organic molecule
Emp. Form.:
C20H19F4N5O4
Mol. Mass.:
469.3896
SMILES:
NC(=N)Nc1cccc(c1)C(=O)NCC(=O)NC(CC(O)=O)c1cc(F)cc(c1)C(F)(F)F
: