Target
Integrin alpha-5/alpha-8
Ligand
BDBM279564
Substrate
Meas. Tech.
Solid Phase Receptor Assay (SPRA) for alpha8beta1 Function
IC50
0.900±n/a nM
Citation
 Ruminski, PGGriggs, DW Meta-azacyclic amino benzoic acid derivatives as pan integrin antagonists US Patent  US10577330 Publication Date 3/3/2020 
Target
Name:
Integrin alpha-5/alpha-8
Synonyms:
Integrin alpha8beta1
Type:
Protein
Mol. Mass.:
Description:
Components:
This complex has 2 components.
Component 1
Name:
Integrin alpha-5
Synonyms:
CD49 antigen-like family member E FNRA Fibronectin receptor subunit alpha ITGA5 Integrin alpha-F | VLA-5
Type:
Single-pass type I membrane protein
Mol. Mass.:
114523.00
Organism:
Homo sapiens (Human)
Description:
Residue:
1049
  
Component 2
Name:
Integrin alpha-8
Synonyms:
ITA8_HUMAN | ITGA8
Type:
Enzyme Catalytic Domain
Mol. Mass.:
117456.11
Organism:
Homo sapiens (Human)
Description:
Residue:
1063
  
Inhibitor
Name:
BDBM279564
Synonyms:
(3S)-3-[3-chloro-5-(trifluoromethyl)phenyl)-3-(2-(3-hydroxy-5-((5-hydroxy-1,4,5,6-tetrahydropyrimidin-2-yl)amino)benzamido)acetamido]propanoic acid US10577330, Example 5
Type:
Small organic molecule
Emp. Form.:
C23H23ClF3N5O6
Mol. Mass.:
557.907
SMILES:
OC1CNC(Nc2cc(O)cc(c2)C(=O)NCC(=O)N[C@@H](CC(O)=O)c2cc(Cl)cc(c2)C(F)(F)F)=NC1
: