Target
Integrin alpha-5/alpha-8
Ligand
BDBM279573
Substrate
Meas. Tech.
Solid Phase Receptor Assay (SPRA) for alpha8beta1 Function
IC50
0.400±n/a nM
Citation
 Ruminski, PGGriggs, DW Meta-azacyclic amino benzoic acid derivatives as pan integrin antagonists US Patent  US10577330 Publication Date 3/3/2020 
Target
Name:
Integrin alpha-5/alpha-8
Synonyms:
Integrin alpha8beta1
Type:
Protein
Mol. Mass.:
Description:
Components:
This complex has 2 components.
Component 1
Name:
Integrin alpha-5
Synonyms:
CD49 antigen-like family member E FNRA Fibronectin receptor subunit alpha ITGA5 Integrin alpha-F | VLA-5
Type:
Single-pass type I membrane protein
Mol. Mass.:
114523.00
Organism:
Homo sapiens (Human)
Description:
Residue:
1049
  
Component 2
Name:
Integrin alpha-8
Synonyms:
ITA8_HUMAN | ITGA8
Type:
Enzyme Catalytic Domain
Mol. Mass.:
117456.11
Organism:
Homo sapiens (Human)
Description:
Residue:
1063
  
Inhibitor
Name:
BDBM279573
Synonyms:
(3S)-3-(3,5-dibromophenyl)-3-[[2-[[5-[(5-hydroxy-1,4,5,6-tetrahydropyrimidin-2-yl)amino]pyridine-3-carbonyl]amino]acetyl]amino]propanoic acid US10577330, Example 14
Type:
Small organic molecule
Emp. Form.:
C21H22Br2N6O5
Mol. Mass.:
598.245
SMILES:
OC1CNC(Nc2cncc(c2)C(=O)NCC(=O)N[C@@H](CC(O)=O)c2cc(Br)cc(Br)c2)=NC1
: