Target
Histone-lysine N-methyltransferase SMYD3
Ligand
BDBM432831
Substrate
Meas. Tech.
SMYD3 Biochemical Assay
IC50
1.10±n/a nM
Citation
 Mitchell, LHBell, ASChesworth, RFoley, MAKuntz, KWMills, JEMunchhof, MJ Substituted piperidine compounds US Patent  US10577363 Publication Date 3/3/2020 
Target
Name:
Histone-lysine N-methyltransferase SMYD3
Synonyms:
SET and MYND domain-containing protein 3 SMYD3_HUMAN ZNFN3A1 | Zinc finger MYND domain-containing protein 1
Type:
Enzyme
Mol. Mass.:
49101.22
Organism:
Homo sapiens (Human)
Description:
Q9H7B4-2
Residue:
428
  
Inhibitor
Name:
BDBM432831
Synonyms:
5-cyclopropyl-N-((1R,3r,5S)-8-(((1-(3- hydroxypropyl)piperidin-4- yl)methyl)sulfonyl)-8- azabicyclo[3.2.1]octan-3-yl)isoxazole-3- carboxamide | US10577363, Compound 534
Type:
Small organic molecule
Emp. Form.:
C23H36N4O5S
Mol. Mass.:
480.621
SMILES:
OCCCN1CCC(CS(=O)(=O)N2[C@H]3CC[C@@H]2C[C@@H](C3)NC(=O)c2cc(on2)C2CC2)CC1
: