Target
Histone-lysine N-methyltransferase SMYD3
Ligand
BDBM433070
Substrate
Meas. Tech.
SMYD3 Biochemical Assay
IC50
1.04±n/a nM
Citation
 Mitchell, LHBell, ASChesworth, RFoley, MAKuntz, KWMills, JEMunchhof, MJ Substituted piperidine compounds US Patent  US10577363 Publication Date 3/3/2020 
Target
Name:
Histone-lysine N-methyltransferase SMYD3
Synonyms:
SET and MYND domain-containing protein 3 SMYD3_HUMAN ZNFN3A1 | Zinc finger MYND domain-containing protein 1
Type:
Enzyme
Mol. Mass.:
49101.22
Organism:
Homo sapiens (Human)
Description:
Q9H7B4-2
Residue:
428
  
Inhibitor
Name:
BDBM433070
Synonyms:
N-((2S,4S)-1-((4-amino-4-methylpiperidin- l-yl)sulfonyl)-2-methylpiperidin-4-yl)-5- cyclopropylisoxazole-3-carboxamide | US10577363, Compound 774
Type:
Small organic molecule
Emp. Form.:
C19H31N5O4S
Mol. Mass.:
425.546
SMILES:
C[C@H]1C[C@H](CCN1S(=O)(=O)N1CCC(C)(N)CC1)NC(=O)c1cc(on1)C1CC1
: