Target
Histone-lysine N-methyltransferase SMYD3
Ligand
BDBM433071
Substrate
Meas. Tech.
SMYD3 Biochemical Assay
IC50
1.07±n/a nM
Citation
 Mitchell, LHBell, ASChesworth, RFoley, MAKuntz, KWMills, JEMunchhof, MJ Substituted piperidine compounds US Patent  US10577363 Publication Date 3/3/2020 
Target
Name:
Histone-lysine N-methyltransferase SMYD3
Synonyms:
SET and MYND domain-containing protein 3 SMYD3_HUMAN ZNFN3A1 | Zinc finger MYND domain-containing protein 1
Type:
Enzyme
Mol. Mass.:
49101.22
Organism:
Homo sapiens (Human)
Description:
Q9H7B4-2
Residue:
428
  
Inhibitor
Name:
BDBM433071
Synonyms:
5-cyclopropyl-N-((2R,4R)-2-ethyl-1-(((1- methylpiperidin-4- yl)methyl)sulfonyl)piperidin-4- yl)isoxazole-3-carboxamide | US10577363, Compound 775
Type:
Small organic molecule
Emp. Form.:
C21H34N4O4S
Mol. Mass.:
438.584
SMILES:
CC[C@@H]1C[C@@H](CCN1S(=O)(=O)CC1CCN(C)CC1)NC(=O)c1cc(on1)C1CC1
: