Target
5-hydroxytryptamine receptor 1A
Ligand
BDBM433546
Substrate
Meas. Tech.
Receptor Binding Assay
Ki
0.090±n/a nM
Citation
 Sniecikowska, JBucki, ANewman-Tancredi, AVarney, MA Compounds for treating disorders sensitive to serotoninergic regulation controlled by the 5-HT1A receptors US Patent  US10562853 Publication Date 2/18/2020 
Target
Name:
5-hydroxytryptamine receptor 1A
Synonyms:
5-HT-1A 5-hydroxytryptamine receptor 1A (5-HT-1A) ADRB2RL1 Dopamine D2 receptor and serotonin 1a receptor HTR1A | Serotonin receptor 1A
Type:
Mol. Mass.:
46122.49
Organism:
Homo sapiens (Human)
Description:
Residue:
422
  
Inhibitor
Name:
BDBM433546
Synonyms:
US10562853, Compound 68
Type:
Small organic molecule
Emp. Form.:
C21H24ClF2N3O3
Mol. Mass.:
439.883
SMILES:
COc1ccnc(OCCNCC2(F)CCN(CC2)C(=O)c2ccc(F)c(Cl)c2)c1
: