Target
Toll-like receptor 8
Ligand
BDBM307531
Substrate
Meas. Tech.
Human TLR8 Assay
EC50
>10000±n/a nM
Citation
 Hori, SHasegawa, FUrabe, DKurebayashi, H Carboxylic acid compounds US Patent  US10562861 Publication Date 2/18/2020 
Target
Name:
Toll-like receptor 8
Synonyms:
CD_antigen: CD288 TLR8_HUMAN | TRL8
Type:
Enzyme
Mol. Mass.:
119828.77
Organism:
Homo sapiens (Human)
Description:
Q9NR97
Residue:
1041
  
Inhibitor
Name:
BDBM307531
Synonyms:
(S)-2-((3-(4-((2-amino-4-(l-hydroxyhexan-3-ylamino)-6-methylpyrimidin-5-yl)methyl)-3-methoxyphenoxy)propyl)(2,2-difluoroethyl)amino)acetic acid US10562861, Ex. No. 12
Type:
Small organic molecule
Emp. Form.:
C26H39F2N5O5
Mol. Mass.:
539.6152
SMILES:
CCC[C@@H](CCO)Nc1nc(N)nc(C)c1Cc1ccc(OCCCN(CC(F)F)CC(O)=O)cc1OC
: