Target
Chloroquine resistance transporter
Ligand
BDBM434956
Substrate
Meas. Tech.
Efficacy of ELQ-337 In Vitro
IC50
3.00±n/a nM
Citation
 Riscoe, MNilsen, AMiley, GWinter, RPou, SKelly, JXDodean, R Quinolone-3-diarylethers US Patent  US10584098 Publication Date 3/10/2020  Article 
Target
Name:
Chloroquine resistance transporter
Synonyms:
CRT PfCRT
Type:
PROTEIN
Mol. Mass.:
48687.29
Organism:
Plasmodium falciparum
Description:
ChEMBL_1364181
Residue:
424
  
Inhibitor
Name:
BDBM434956
Synonyms:
US10584098, Code ELQ-354
Type:
Small organic molecule
Emp. Form.:
C28H23ClF3NO7
Mol. Mass.:
577.933
SMILES:
COCCOC(=O)Oc1c(c(C)nc2cc(CO)c(Cl)cc12)-c1ccc(Oc2ccc(OC(F)(F)F)cc2)cc1
: