Target
5'-nucleotidase
Ligand
BDBM435851
Substrate
Meas. Tech.
Inhibition Enzyme In Vitro Assay
IC50
48.0±n/a nM
Citation
 Billedeau, RJLi, JChen, L Ectonucleotidase inhibitors and methods of use thereof US Patent  US10570167 Publication Date 2/25/2020 
Target
Name:
5'-nucleotidase
Synonyms:
5'-NT 5NTD_HUMAN Ecto-5'-nucleotidase NT5 NTE
Type:
Enzyme
Mol. Mass.:
63371.54
Organism:
Homo sapiens (Human)
Description:
P21589
Residue:
574
  
Inhibitor
Name:
BDBM435851
Synonyms:
US10570167, Cpd. # 177 | US11034715, Cpd. # 177
Type:
Small organic molecule
Emp. Form.:
C24H23ClFN7O7
Mol. Mass.:
575.934
SMILES:
Cc1[nH]ncc1-c1ccc(CC(OC[C@H]2O[C@H]([C@@H](F)[C@@H]2O)n2cnc3c(N)nc(Cl)nc23)(C(O)=O)C(O)=O)cc1
: