Target
Dimer of Gag-Pol polyprotein [489-587]
Ligand
BDBM7075
Substrate
Fluorescent peptide substrate
Meas. Tech.
Protease Inhibition Assay
pH
5.5±n/a
Temperature
310.15±n/a K
Ki
0.11±n/a nM
Citation
 Patel, MKaltenbach, RFNugiel, DAMcHugh, RJJadhav, PKBacheler, LTCordova, BCKlabe, RMErickson-Viitanen, SGarber, SReid, CSeitz, SP The synthesis of symmetrical and unsymmetrical P1/P1' cyclic ureas as HIV protease inhibitors. Bioorg Med Chem Lett 8:1077-82 (1998)  
Target
Name:
Dimer of Gag-Pol polyprotein [489-587]
Synonyms:
HIV-1 Protease
Type:
Protein Complex
Mol. Mass.:
Description:
Components:
This complex has 2 components.
Component 1
Name:
Gag-Pol polyprotein [489-587]
Synonyms:
HIV protease HIV-1 Protease chain A POL_HV1N5 | gag-pol
Type:
Enzyme Subunit
Mol. Mass.:
10822.21
Organism:
Human immunodeficiency virus type 1
Description:
P12497[489-587]
Residue:
99
  
Component 2
Name:
Gag-Pol polyprotein [489-587]
Synonyms:
HIV protease HIV-1 Protease chain A POL_HV1N5 | gag-pol
Type:
Enzyme Subunit
Mol. Mass.:
10822.21
Organism:
Human immunodeficiency virus type 1
Description:
P12497[489-587]
Residue:
99
  
Inhibitor
Name:
BDBM7075
Synonyms:
(4R,5S,6S,7R)-5,6-dihydroxy-1,3-bis({[4-(hydroxymethyl)phenyl]methyl})-4,7-bis[(3-methoxyphenyl)methyl]-1,3-diazepan-2-one Substituted Cyclic Urea 65
Type:
Small organic molecule
Emp. Form.:
C37H42N2O7
Mol. Mass.:
626.7386
SMILES:
COc1cccc(C[C@@H]2[C@H](O)[C@@H](O)[C@@H](Cc3cccc(OC)c3)N(Cc3ccc(CO)cc3)C(=O)N2Cc2ccc(CO)cc2)c1
:
Substrate
Name:
Fluorescent peptide substrate
Synonyms:
Type:
Peptide
Mol. Mass.:
4608.75
Organism:
Description:
Residue:
42