Target
Mu-type opioid receptor
Ligand
BDBM438844
Substrate
Meas. Tech.
Competitive Displacement Assay
Ki
<1±n/a nM
Citation
 Wynn, TAAlvarez, JCMoustakas, DTHaeberlein, MPennington, LD Compounds for the treatment of pain US Patent  US10604489 Publication Date 3/31/2020 
Target
Name:
Mu-type opioid receptor
Synonyms:
M-OR-1 MOR-1 MUOR1 Mu opiate receptor OPRM1 hMOP | mu-type opioid receptor isoform MOR-1
Type:
G Protein-Coupled Receptor (GPCR)
Mol. Mass.:
44789.51
Organism:
Homo sapiens (Human)
Description:
P35372
Residue:
400
  
Inhibitor
Name:
BDBM438844
Synonyms:
3-((1R,5S,9r)-3-(4,4-difluorocyclohexyl)-9-methoxy-3-azabicyclo[3.3.1]nonan-9-yl)benzamide hydrochloride US11180455, Compound 196
Type:
Small organic molecule
Emp. Form.:
C22H30F2N2O2
Mol. Mass.:
392.4826
SMILES:
COC1(C2CCCC1CN(C2)C1CCC(F)(F)CC1)c1cccc(c1)C(N)=O
: