Target
Mu-type opioid receptor
Ligand
BDBM438873
Substrate
Meas. Tech.
Competitive Displacement Assay
Ki
<1±n/a nM
Citation
 Wynn, TAAlvarez, JCMoustakas, DTHaeberlein, MPennington, LD Compounds for the treatment of pain US Patent  US10604489 Publication Date 3/31/2020 
Target
Name:
Mu-type opioid receptor
Synonyms:
M-OR-1 MOR-1 MUOR1 Mu opiate receptor OPRM1 hMOP | mu-type opioid receptor isoform MOR-1
Type:
G Protein-Coupled Receptor (GPCR)
Mol. Mass.:
44789.51
Organism:
Homo sapiens (Human)
Description:
P35372
Residue:
400
  
Inhibitor
Name:
BDBM438873
Synonyms:
(1R,5S,9r)-tert-butyl 9-(3-hydroxphenyl)-9-methoxy-3-azabicyclo[3.3.1]nonane-3-carboxylate US11180455, Compound 35
Type:
Small organic molecule
Emp. Form.:
C16H22N2O2
Mol. Mass.:
274.3581
SMILES:
COC1(C2CCCC1CNC2)c1cccc(c1)C(N)=O
: