Target
Mu-type opioid receptor
Ligand
BDBM438967
Substrate
Meas. Tech.
Competitive Displacement Assay
Ki
<1±n/a nM
Citation
 Wynn, TAAlvarez, JCMoustakas, DTHaeberlein, MPennington, LD Compounds for the treatment of pain US Patent  US10604489 Publication Date 3/31/2020 
Target
Name:
Mu-type opioid receptor
Synonyms:
M-OR-1 MOR-1 MUOR1 Mu opiate receptor OPRM1 hMOP | mu-type opioid receptor isoform MOR-1
Type:
G Protein-Coupled Receptor (GPCR)
Mol. Mass.:
44789.51
Organism:
Homo sapiens (Human)
Description:
P35372
Residue:
400
  
Inhibitor
Name:
BDBM438967
Synonyms:
3-((1R,5S,9r)-9-methoxy-3-(2-methoxyethyl)-3-azabicyclo[3.3.1]nonan-9-yl)benzamide hydrochloride US11180455, Compound 128
Type:
Small organic molecule
Emp. Form.:
C19H28N2O3
Mol. Mass.:
332.4372
SMILES:
COCCN1CC2CCCC(C1)C2(OC)c1cccc(c1)C(N)=O
: